#31 ✓resolved
Deleted User

Build Fails on clean git clone and build.sh

Reported by Deleted User | October 8th, 2010 @ 11:29 AM | in Rundeck 1.1

[ERROR] BUILD FAILED
[ERROR] File...... /Users/noahcampbell/Projects/Rundeck/t2/maven/plugins/maven-test-plugin-1.1/plugin.jelly
[ERROR] Element... taskdef
[ERROR] Line...... 80
[ERROR] Column.... 9
[ERROR] taskdef class org.apache.tools.ant.taskdefs.optional.junit.JUnitTask cannot be found
Total time: 1 minutes 46 seconds

The workaround is to run the build command again, but it's probably not a desirable "first impression."

Comments and changes to this ticket

Please Sign in or create a free account to add a new ticket.

With your very own profile, you can contribute to projects, track your activity, watch tickets, receive and update tickets through your email and much more.

New ticket Create new ticket

Create your profile

Help contribute to this project by taking a few moments to create your personal profile. Create your profile ยป

(DEPRECATED) Please use github issues for issue tracking at http://github.com/dtolabs/rundeck/issues

Shared Ticket Bins

People watching this ticket

Tags

Pages