Lighthouse has a new layout. Prefer the old one? Return to the old layout, and switch back any time from the link at the top of each page.

Build Fails on clean git clone and build.sh

#31
[ERROR] BUILD FAILED
[ERROR] File...... /Users/noahcampbell/Projects/Rundeck/t2/maven/plugins/maven-test-plugin-1.1/plugin.jelly
[ERROR] Element... taskdef
[ERROR] Line...... 80
[ERROR] Column.... 9
[ERROR] taskdef class org.apache.tools.ant.taskdefs.optional.junit.JUnitTask cannot be found
Total time: 1 minutes 46 seconds

The workaround is to run the build command again, but it's probably not a desirable "first impression."

Reported by Deleted User · October 8th, 2010 @ 11:29 AM

State: resolved
Milestone: Rundeck 1.1
Assigned to: Greg Schueler Greg Schueler

Activity

Please Sign in or create a free account to add a new ticket.

With your very own profile, you can contribute to projects, track your activity, watch tickets, receive and update tickets through your email and much more.